Revision history [back]

click to hide/show revision 1
initial version

Error building Gateway Agent: scons: *** [ws] Error 1

I am following the steps in https://wiki.allseenalliance.org/gateway/getting_started. However, I encountered a build error in Building the Gateway Agent.

$ scons BINDINGS=cpp OS=linux CPU=x86 VARIANT=debug BUILD_SERVICES_SAMPLES=off POLICYDB=on ALLJOYN_DISTDIR=$AJ_ROOT/core/alljoyn/build/linux/x86/debug/dist scons: Reading SConscript files ... BULLSEYE_BIN not specified GTEST_DIR not specified skipping common unit test build BULLSEYE_BIN not specified GTEST_DIR not specified skipping About Service unit test build GTEST_DIR not specified skipping alljoyn_core unit test build

scons: warning: Ignoring missing SConscript 'build/linux/x86/debug/obj/services/about/SConscript' File "/home/sesa288124/alljoyn/core/alljoyn/alljoyn_core/samples/eventaction/SConscript", line 35, in <module> scons: done reading SConscript files. scons: Building targets ... wsbuild(["ws"], ["/home/sesa288124/alljoyn/core/alljoyn/build_core/$DISTDIR"]) Evaluating whitespace compliance... Config: /home/sesa288124/alljoyn/core/alljoyn/build_core/tools/conf/ajuncrustify.cfg Note: enter 'scons -h' to see whitespace (WS) options whitespace check /home/sesa288124/alljoyn/core/alljoyn/build_core/tools/conf/ajuncrustify.cfg cwd=/home/sesa288124/alljoyn/gateway/gwagent /home/sesa288124/alljoyn/gateway/gwagent/cpp/GatewayConnector/samples/main.cc WS total run time: 0.01 seconds scons: * [ws] Error 1 scons: building terminated because of errors.

Error building Gateway Agent: scons: *** [ws] Error 1

I am following the steps in https://wiki.allseenalliance.org/gateway/getting_started. However, I encountered a build error in Building the Gateway Agent.

$ scons BINDINGS=cpp OS=linux CPU=x86 VARIANT=debug BUILD_SERVICES_SAMPLES=off POLICYDB=on ALLJOYN_DISTDIR=$AJ_ROOT/core/alljoyn/build/linux/x86/debug/dist
scons: Reading SConscript files ...
BULLSEYE_BIN not specified
GTEST_DIR not specified skipping common unit test build
BULLSEYE_BIN not specified
GTEST_DIR not specified skipping About Service unit test build
GTEST_DIR not specified skipping alljoyn_core unit test build

build

scons: warning: Ignoring missing SConscript 'build/linux/x86/debug/obj/services/about/SConscript' File "/home/sesa288124/alljoyn/core/alljoyn/alljoyn_core/samples/eventaction/SConscript", line 35, in <module> scons: done reading SConscript files. scons: Building targets ... wsbuild(["ws"], ["/home/sesa288124/alljoyn/core/alljoyn/build_core/$DISTDIR"]) Evaluating whitespace compliance... Config: /home/sesa288124/alljoyn/core/alljoyn/build_core/tools/conf/ajuncrustify.cfg Note: enter 'scons -h' to see whitespace (WS) options whitespace check /home/sesa288124/alljoyn/core/alljoyn/build_core/tools/conf/ajuncrustify.cfg cwd=/home/sesa288124/alljoyn/gateway/gwagent /home/sesa288124/alljoyn/gateway/gwagent/cpp/GatewayConnector/samples/main.cc WS total run time: 0.01 seconds scons: * *** [ws] Error 1 scons: building terminated because of errors.

errors.